BDBM510054 N-[(2S)-1-({(1S)-1-Cyano-2-[(3S)-2-oxopyrrolidin-3-yl]ethyl}amino)-4-methyl-1-oxopentan- 2-yl]-4-methoxy-7-(trifluoromethyl)-1H-indole-2-carboxamide (6)::US11351149, Example 6::WO2021250648, Example 6
SMILES COc1ccc(c2[nH]c(cc12)C(=O)N[C@@H](CC(C)C)C(=O)N[C@@H](C[C@@H]1CCNC1=O)C#N)C(F)(F)F
InChI Key InChIKey=PTGYXJBPMNPISM-ZQIUZPCESA-N
Data  1 KI  1 IC50  1 EC50
  Tab Delimited (TSV)   2D SDfile   Computed 3D by Vconf -m prep SDfile
Find this compound or compounds like it in BindingDB:
Activity Spreadsheet -- Enzyme Inhibition Constant Data from BindingDB
Found 1 hit for monomerid = 510054
TargetReplicase polyprotein 1a(2019-nCoV)
Pfizer
US Patent
LigandPNGBDBM510054(N-[(2S)-1-({(1S)-1-Cyano-2-[(3S)-2-oxopyrrolidin-3...)
Affinity DataKi:  23nM. Assay description: The proteolytic activity of the main protease, 3CLpro, of SARS-CoV-2 was monitored using a continuous fluorescence resonance energy transfer (FRET) a...
Ligand InfoPC cidPC sid
In DepthDetails US Patent